Information card for entry 7242364
Formula | C17 H10 N5 Na O |
Calculated formula | C17 H10 N5 Na O |
Title of publication | Alkali metal salts of a tetracyanopyridine (TCPy) derivative: structure characterization and luminescence properties |
Authors of publication | Chunikhin, Sergey S.; Ershov, Oleg V.; Yatsenko, Alexandr V.; Tafeenko, Viktor A.; Dmitrieva, Natalia E.; Ievlev, Mikhail Yu. |
Journal of publication | CrystEngComm |
Year of publication | 2021 |
Journal volume | 23 |
Journal issue | 15 |
Pages of publication | 2816 - 2824 |
a | 18.6417 ± 0.0005 Å |
b | 6.1755 ± 0.0002 Å |
c | 30.2781 ± 0.0011 Å |
α | 90° |
β | 116.722 ± 0.002° |
γ | 90° |
Cell volume | 3113.4 ± 0.18 Å3 |
Cell temperature | 295 ± 2 K |
Ambient diffraction temperature | 295 K |
Number of distinct elements | 5 |
Space group number | 15 |
Hermann-Mauguin space group symbol | C 1 2/c 1 |
Hall space group symbol | -C 2yc |
Residual factor for all reflections | 0.0664 |
Residual factor for significantly intense reflections | 0.0435 |
Weighted residual factors for significantly intense reflections | 0.1186 |
Weighted residual factors for all reflections included in the refinement | 0.1338 |
Goodness-of-fit parameter for all reflections included in the refinement | 0.929 |
Diffraction radiation wavelength | 1.54186 Å |
Diffraction radiation type | CuKα |