Information card for entry 7242427
Formula | C54 H32 Cd2 N6 O9 S2 |
Calculated formula | C54 H32 Cd2 N6 O9 S2 |
Title of publication | A luminescent Cd(ii) coordination polymer as a multi-responsive fluorescent sensor for Zn2+, Fe3+ and Cr2O72− in water with fluorescence enhancement or quenching |
Authors of publication | Liu, Liangjuan; Ran, Yungen; Du, Jianlong; Wang, Zhichao; Liu, Mei; Mu, Yajuan |
Journal of publication | RSC Advances |
Year of publication | 2021 |
Journal volume | 11 |
Journal issue | 19 |
Pages of publication | 11266 - 11272 |
a | 10.1136 ± 0.001 Å |
b | 9.7173 ± 0.001 Å |
c | 24.005 ± 0.003 Å |
α | 90° |
β | 92.928 ± 0.004° |
γ | 90° |
Cell volume | 2356.1 ± 0.4 Å3 |
Cell temperature | 293 ± 2 K |
Ambient diffraction temperature | 293 ± 2 K |
Number of distinct elements | 6 |
Space group number | 13 |
Hermann-Mauguin space group symbol | P 1 2/c 1 |
Hall space group symbol | -P 2yc |
Residual factor for all reflections | 0.0732 |
Residual factor for significantly intense reflections | 0.0414 |
Weighted residual factors for significantly intense reflections | 0.0786 |
Weighted residual factors for all reflections included in the refinement | 0.0871 |
Goodness-of-fit parameter for all reflections included in the refinement | 1.049 |
Diffraction radiation wavelength | 0.71073 Å |
Diffraction radiation type | MoKα |