Information card for entry 7242428
Formula | C16.5 H18 Fe Mn N13 O2 S2 |
Calculated formula | C16.5 H18 Fe Mn N13 O2 S2 |
Title of publication | Cyano-bridged polynuclear coordination compounds derived from paramagnetic [Mn(H2daptsc)]2+ and photochromic [Fe(CN)5NO]2− building blocks |
Authors of publication | Sasnovskaya, Valentina D.; Zorina, Leokadiya V.; Simonov, Sergey V.; Talantsev, Artem D.; Mikhailov, Artem A.; Kostin, Gennadiy A.; Yagubskii, Eduard B. |
Journal of publication | CrystEngComm |
Year of publication | 2021 |
Journal volume | 23 |
Journal issue | 14 |
Pages of publication | 2733 - 2745 |
a | 7.9854 ± 0.0003 Å |
b | 9.1752 ± 0.0003 Å |
c | 10.0446 ± 0.0004 Å |
α | 109.095 ± 0.003° |
β | 93.499 ± 0.003° |
γ | 114.294 ± 0.003° |
Cell volume | 617.3 ± 0.05 Å3 |
Cell temperature | 150 ± 1 K |
Ambient diffraction temperature | 150 ± 1 K |
Number of distinct elements | 7 |
Space group number | 1 |
Hermann-Mauguin space group symbol | P 1 |
Hall space group symbol | P 1 |
Residual factor for all reflections | 0.0238 |
Residual factor for significantly intense reflections | 0.0225 |
Weighted residual factors for significantly intense reflections | 0.0535 |
Weighted residual factors for all reflections included in the refinement | 0.0547 |
Goodness-of-fit parameter for all reflections included in the refinement | 1.002 |
Diffraction radiation probe | x-ray |
Diffraction radiation wavelength | 0.71073 Å |
Diffraction radiation type | MoKα |