Information card for entry 7242429
Formula | C56 H77 Fe3 Mn3 N39 O11 S6 |
Calculated formula | C56 H77 Fe3 Mn3 N39 O11 S6 |
Title of publication | Cyano-bridged polynuclear coordination compounds derived from paramagnetic [Mn(H2daptsc)]2+ and photochromic [Fe(CN)5NO]2− building blocks |
Authors of publication | Sasnovskaya, Valentina D.; Zorina, Leokadiya V.; Simonov, Sergey V.; Talantsev, Artem D.; Mikhailov, Artem A.; Kostin, Gennadiy A.; Yagubskii, Eduard B. |
Journal of publication | CrystEngComm |
Year of publication | 2021 |
Journal volume | 23 |
Journal issue | 14 |
Pages of publication | 2733 - 2745 |
a | 9.4079 ± 0.0002 Å |
b | 10.1883 ± 0.0003 Å |
c | 23.8729 ± 0.0006 Å |
α | 91.19 ± 0.002° |
β | 93.989 ± 0.002° |
γ | 111.582 ± 0.002° |
Cell volume | 2120 ± 0.1 Å3 |
Cell temperature | 150 ± 1 K |
Ambient diffraction temperature | 150 ± 1 K |
Number of distinct elements | 7 |
Space group number | 1 |
Hermann-Mauguin space group symbol | P 1 |
Hall space group symbol | P 1 |
Residual factor for all reflections | 0.0543 |
Residual factor for significantly intense reflections | 0.0478 |
Weighted residual factors for significantly intense reflections | 0.1102 |
Weighted residual factors for all reflections included in the refinement | 0.1162 |
Goodness-of-fit parameter for all reflections included in the refinement | 1 |
Diffraction radiation probe | x-ray |
Diffraction radiation wavelength | 0.71073 Å |
Diffraction radiation type | MoKα |