Information card for entry 7242443
Formula | C20 H31 Br N Ni O6 S10 |
Calculated formula | C20 H31 Br N Ni O6 S10 |
Title of publication | Molecular motion of halogenated ethylammonium/[18]crown-6 supramolecular ions in nickel dithiolate magnetic crystals |
Authors of publication | Hasuo, Naohiro; Takahashi, Kiyonori; Hisaki, Ichiro; Kokado, Kenta; Nakamura, Takayoshi |
Journal of publication | CrystEngComm |
Year of publication | 2021 |
Journal volume | 23 |
Journal issue | 14 |
Pages of publication | 2756 - 2763 |
a | 11.0374 ± 0.0003 Å |
b | 12.0627 ± 0.0003 Å |
c | 13.7656 ± 0.0004 Å |
α | 64.349 ± 0.003° |
β | 79.574 ± 0.002° |
γ | 78.92 ± 0.002° |
Cell volume | 1611.41 ± 0.09 Å3 |
Cell temperature | 173 K |
Ambient diffraction temperature | 173 K |
Number of distinct elements | 7 |
Space group number | 2 |
Hermann-Mauguin space group symbol | P -1 |
Hall space group symbol | -P 1 |
Residual factor for all reflections | 0.0558 |
Residual factor for significantly intense reflections | 0.0333 |
Weighted residual factors for significantly intense reflections | 0.069 |
Weighted residual factors for all reflections included in the refinement | 0.0746 |
Goodness-of-fit parameter for all reflections included in the refinement | 1.039 |
Diffraction radiation probe | x-ray |
Diffraction radiation wavelength | 0.71073 Å |
Diffraction radiation type | MoKα |