Information card for entry 7242444
Formula | C20 H31 Br N Ni O6 S10 |
Calculated formula | C20 H31 Br N Ni O6 S10 |
Title of publication | Molecular motion of halogenated ethylammonium/[18]crown-6 supramolecular ions in nickel dithiolate magnetic crystals |
Authors of publication | Hasuo, Naohiro; Takahashi, Kiyonori; Hisaki, Ichiro; Kokado, Kenta; Nakamura, Takayoshi |
Journal of publication | CrystEngComm |
Year of publication | 2021 |
Journal volume | 23 |
Journal issue | 14 |
Pages of publication | 2756 - 2763 |
a | 11.076 ± 0.0003 Å |
b | 12.0662 ± 0.0003 Å |
c | 13.7164 ± 0.0005 Å |
α | 65.106 ± 0.003° |
β | 80.573 ± 0.003° |
γ | 78.719 ± 0.002° |
Cell volume | 1623.84 ± 0.09 Å3 |
Cell temperature | 233 K |
Ambient diffraction temperature | 233 K |
Number of distinct elements | 7 |
Space group number | 2 |
Hermann-Mauguin space group symbol | P -1 |
Hall space group symbol | -P 1 |
Residual factor for all reflections | 0.0766 |
Residual factor for significantly intense reflections | 0.0405 |
Weighted residual factors for significantly intense reflections | 0.0923 |
Weighted residual factors for all reflections included in the refinement | 0.1033 |
Goodness-of-fit parameter for all reflections included in the refinement | 1.019 |
Diffraction radiation probe | x-ray |
Diffraction radiation wavelength | 0.71073 Å |
Diffraction radiation type | MoKα |