Information card for entry 7242445
Formula | C20 H31 Br N Ni O6 S10 |
Calculated formula | C20 H31 Br1.001 N Ni O6 S10 |
Title of publication | Molecular motion of halogenated ethylammonium/[18]crown-6 supramolecular ions in nickel dithiolate magnetic crystals |
Authors of publication | Hasuo, Naohiro; Takahashi, Kiyonori; Hisaki, Ichiro; Kokado, Kenta; Nakamura, Takayoshi |
Journal of publication | CrystEngComm |
Year of publication | 2021 |
Journal volume | 23 |
Journal issue | 14 |
Pages of publication | 2756 - 2763 |
a | 11.2167 ± 0.0004 Å |
b | 12.1808 ± 0.0004 Å |
c | 13.7373 ± 0.0005 Å |
α | 65.696 ± 0.003° |
β | 81.308 ± 0.003° |
γ | 78.012 ± 0.003° |
Cell volume | 1668.72 ± 0.11 Å3 |
Cell temperature | 373 K |
Ambient diffraction temperature | 373 K |
Number of distinct elements | 7 |
Space group number | 2 |
Hermann-Mauguin space group symbol | P -1 |
Hall space group symbol | -P 1 |
Residual factor for all reflections | 0.1032 |
Residual factor for significantly intense reflections | 0.047 |
Weighted residual factors for significantly intense reflections | 0.1118 |
Weighted residual factors for all reflections included in the refinement | 0.1318 |
Goodness-of-fit parameter for all reflections included in the refinement | 1.008 |
Diffraction radiation probe | x-ray |
Diffraction radiation wavelength | 0.71073 Å |
Diffraction radiation type | MoKα |