Information card for entry 7242449
Formula | C20 H31 Cl N Ni O6 S10 |
Calculated formula | C20 H31 Cl N Ni O6 S10 |
Title of publication | Molecular motion of halogenated ethylammonium/[18]crown-6 supramolecular ions in nickel dithiolate magnetic crystals |
Authors of publication | Hasuo, Naohiro; Takahashi, Kiyonori; Hisaki, Ichiro; Kokado, Kenta; Nakamura, Takayoshi |
Journal of publication | CrystEngComm |
Year of publication | 2021 |
Journal volume | 23 |
Journal issue | 14 |
Pages of publication | 2756 - 2763 |
a | 11.2637 ± 0.0002 Å |
b | 12.342 ± 0.0001 Å |
c | 12.8337 ± 0.0002 Å |
α | 91.372 ± 0.001° |
β | 110.996 ± 0.001° |
γ | 96.45 ± 0.001° |
Cell volume | 1651.13 ± 0.04 Å3 |
Cell temperature | 213 K |
Ambient diffraction temperature | 213 K |
Number of distinct elements | 7 |
Space group number | 2 |
Hermann-Mauguin space group symbol | P -1 |
Hall space group symbol | -P 1 |
Residual factor for all reflections | 0.0327 |
Residual factor for significantly intense reflections | 0.031 |
Weighted residual factors for significantly intense reflections | 0.0815 |
Weighted residual factors for all reflections included in the refinement | 0.0831 |
Goodness-of-fit parameter for all reflections included in the refinement | 1.034 |
Diffraction radiation probe | x-ray |
Diffraction radiation wavelength | 1.54184 Å |
Diffraction radiation type | CuKα |