Information card for entry 7242450
Formula | C20 H31 Cl N Ni O6 S10 |
Calculated formula | C20 H31 Cl N Ni O6 S10 |
Title of publication | Molecular motion of halogenated ethylammonium/[18]crown-6 supramolecular ions in nickel dithiolate magnetic crystals |
Authors of publication | Hasuo, Naohiro; Takahashi, Kiyonori; Hisaki, Ichiro; Kokado, Kenta; Nakamura, Takayoshi |
Journal of publication | CrystEngComm |
Year of publication | 2021 |
Journal volume | 23 |
Journal issue | 14 |
Pages of publication | 2756 - 2763 |
a | 11.2714 ± 0.0001 Å |
b | 12.3406 ± 0.0001 Å |
c | 12.8452 ± 0.0001 Å |
α | 91.241 ± 0.001° |
β | 110.823 ± 0.001° |
γ | 96.452 ± 0.001° |
Cell volume | 1655.78 ± 0.03 Å3 |
Cell temperature | 233 K |
Ambient diffraction temperature | 233 K |
Number of distinct elements | 7 |
Space group number | 2 |
Hermann-Mauguin space group symbol | P -1 |
Hall space group symbol | -P 1 |
Residual factor for all reflections | 0.0337 |
Residual factor for significantly intense reflections | 0.0319 |
Weighted residual factors for significantly intense reflections | 0.084 |
Weighted residual factors for all reflections included in the refinement | 0.0854 |
Goodness-of-fit parameter for all reflections included in the refinement | 1.054 |
Diffraction radiation probe | x-ray |
Diffraction radiation wavelength | 1.54184 Å |
Diffraction radiation type | CuKα |