Information card for entry 7242477
Formula | C20 H31 F N Ni O6 S10 |
Calculated formula | C20 H31 F N Ni O6 S10 |
Title of publication | Molecular motion of halogenated ethylammonium/[18]crown-6 supramolecular ions in nickel dithiolate magnetic crystals |
Authors of publication | Hasuo, Naohiro; Takahashi, Kiyonori; Hisaki, Ichiro; Kokado, Kenta; Nakamura, Takayoshi |
Journal of publication | CrystEngComm |
Year of publication | 2021 |
Journal volume | 23 |
Journal issue | 14 |
Pages of publication | 2756 - 2763 |
a | 10.5742 ± 0.0007 Å |
b | 12.6426 ± 0.0007 Å |
c | 13.0305 ± 0.0011 Å |
α | 72.446 ± 0.006° |
β | 79.808 ± 0.006° |
γ | 81.42 ± 0.005° |
Cell volume | 1626.1 ± 0.2 Å3 |
Cell temperature | 373 K |
Ambient diffraction temperature | 373 K |
Number of distinct elements | 7 |
Space group number | 2 |
Hermann-Mauguin space group symbol | P -1 |
Hall space group symbol | -P 1 |
Residual factor for all reflections | 0.0887 |
Residual factor for significantly intense reflections | 0.0514 |
Weighted residual factors for significantly intense reflections | 0.1505 |
Weighted residual factors for all reflections included in the refinement | 0.177 |
Goodness-of-fit parameter for all reflections included in the refinement | 0.911 |
Diffraction radiation probe | x-ray |
Diffraction radiation wavelength | 0.71073 Å |
Diffraction radiation type | MoKα |