Information card for entry 7242478
Formula | C20 H31 F N Ni O6 S10 |
Calculated formula | C20 H31 F N Ni O6 S10 |
Title of publication | Molecular motion of halogenated ethylammonium/[18]crown-6 supramolecular ions in nickel dithiolate magnetic crystals |
Authors of publication | Hasuo, Naohiro; Takahashi, Kiyonori; Hisaki, Ichiro; Kokado, Kenta; Nakamura, Takayoshi |
Journal of publication | CrystEngComm |
Year of publication | 2021 |
Journal volume | 23 |
Journal issue | 14 |
Pages of publication | 2756 - 2763 |
a | 10.5377 ± 0.0003 Å |
b | 12.6697 ± 0.0003 Å |
c | 13.0079 ± 0.0004 Å |
α | 71.903 ± 0.002° |
β | 79.822 ± 0.002° |
γ | 80.956 ± 0.002° |
Cell volume | 1615.05 ± 0.08 Å3 |
Cell temperature | 313 K |
Ambient diffraction temperature | 313 K |
Number of distinct elements | 7 |
Space group number | 2 |
Hermann-Mauguin space group symbol | P -1 |
Hall space group symbol | -P 1 |
Residual factor for all reflections | 0.0532 |
Residual factor for significantly intense reflections | 0.0354 |
Weighted residual factors for significantly intense reflections | 0.0855 |
Weighted residual factors for all reflections included in the refinement | 0.0938 |
Goodness-of-fit parameter for all reflections included in the refinement | 1.042 |
Diffraction radiation probe | x-ray |
Diffraction radiation wavelength | 0.71073 Å |
Diffraction radiation type | MoKα |