Information card for entry 7242505
Formula | C18 H18 Mn N2 O8 |
Calculated formula | C18 H18 Mn N2 O8 |
Title of publication | 1D ladder and 2D bilayer coordination polymers constructed from a new T-shaped ligand: luminescence, magnetic and CO2 gas adsorption properties |
Authors of publication | Yin, Meng-Ru; Yan, Qing-Qing; Li, Bin; Yong, Guo-Ping |
Journal of publication | CrystEngComm |
Year of publication | 2021 |
Journal volume | 23 |
Journal issue | 17 |
Pages of publication | 3196 - 3203 |
a | 9.533 ± 0.0003 Å |
b | 9.6406 ± 0.0003 Å |
c | 11.2374 ± 0.0004 Å |
α | 73.591 ± 0.003° |
β | 89.342 ± 0.003° |
γ | 70.111 ± 0.003° |
Cell volume | 927.5 ± 0.06 Å3 |
Cell temperature | 293 ± 2 K |
Ambient diffraction temperature | 293 ± 2 K |
Number of distinct elements | 5 |
Space group number | 2 |
Hermann-Mauguin space group symbol | P -1 |
Hall space group symbol | -P 1 |
Residual factor for all reflections | 0.0429 |
Residual factor for significantly intense reflections | 0.0422 |
Weighted residual factors for significantly intense reflections | 0.1181 |
Weighted residual factors for all reflections included in the refinement | 0.1188 |
Goodness-of-fit parameter for all reflections included in the refinement | 1.052 |
Diffraction radiation wavelength | 1.54184 Å |
Diffraction radiation type | CuKα |