Information card for entry 7242506
Formula | C36 H24 Cd2 Cl2 N4 O9 |
Calculated formula | C36 H23 Cd2 Cl2 N4 O9 |
Title of publication | 1D ladder and 2D bilayer coordination polymers constructed from a new T-shaped ligand: luminescence, magnetic and CO2 gas adsorption properties |
Authors of publication | Yin, Meng-Ru; Yan, Qing-Qing; Li, Bin; Yong, Guo-Ping |
Journal of publication | CrystEngComm |
Year of publication | 2021 |
Journal volume | 23 |
Journal issue | 17 |
Pages of publication | 3196 - 3203 |
a | 20.5062 ± 0.0003 Å |
b | 6.4692 ± 0.0001 Å |
c | 27.8762 ± 0.0003 Å |
α | 90° |
β | 95.957 ± 0.001° |
γ | 90° |
Cell volume | 3678.05 ± 0.09 Å3 |
Cell temperature | 293 ± 2 K |
Ambient diffraction temperature | 293 ± 2 K |
Number of distinct elements | 6 |
Space group number | 15 |
Hermann-Mauguin space group symbol | C 1 2/c 1 |
Hall space group symbol | -C 2yc |
Residual factor for all reflections | 0.0446 |
Residual factor for significantly intense reflections | 0.0431 |
Weighted residual factors for significantly intense reflections | 0.1295 |
Weighted residual factors for all reflections included in the refinement | 0.1311 |
Goodness-of-fit parameter for all reflections included in the refinement | 1.065 |
Diffraction radiation wavelength | 0.71073 Å |
Diffraction radiation type | MoKα |