Information card for entry 7242523
Common name | Cp-1 |
Chemical name | 1 |
Formula | C21 H19 N3 O6 Zn |
Calculated formula | C21 H19 N3 O6 Zn |
Title of publication | Highly efficient fluorescent chemosensor for nitro antibiotic detection based on luminescent coordination polymers with 2,6-di(4-carboxyphenyl)pyrazine |
Authors of publication | Sun, Shuang-Li; Sun, Xi-Yu; Sun, Qian; Gao, En-Qing |
Journal of publication | CrystEngComm |
Year of publication | 2021 |
Journal volume | 23 |
Journal issue | 17 |
Pages of publication | 3167 - 3174 |
a | 9.6073 ± 0.0002 Å |
b | 10.1391 ± 0.0003 Å |
c | 11.8289 ± 0.0003 Å |
α | 98.77 ± 0.002° |
β | 112.985 ± 0.002° |
γ | 106.117 ± 0.002° |
Cell volume | 973.74 ± 0.05 Å3 |
Cell temperature | 293 ± 2 K |
Ambient diffraction temperature | 293 ± 2 K |
Number of distinct elements | 5 |
Space group number | 2 |
Hermann-Mauguin space group symbol | P -1 |
Hall space group symbol | -P 1 |
Residual factor for all reflections | 0.0305 |
Residual factor for significantly intense reflections | 0.0301 |
Weighted residual factors for significantly intense reflections | 0.0789 |
Weighted residual factors for all reflections included in the refinement | 0.0792 |
Goodness-of-fit parameter for all reflections included in the refinement | 1.068 |
Diffraction radiation wavelength | 1.54184 Å |
Diffraction radiation type | CuKα |