Information card for entry 7242524
Formula | C21 H19 Co N3 O6 |
Calculated formula | C21 H19 Co N3 O6 |
Title of publication | Highly efficient fluorescent chemosensor for nitro antibiotic detection based on luminescent coordination polymers with 2,6-di(4-carboxyphenyl)pyrazine |
Authors of publication | Sun, Shuang-Li; Sun, Xi-Yu; Sun, Qian; Gao, En-Qing |
Journal of publication | CrystEngComm |
Year of publication | 2021 |
Journal volume | 23 |
Journal issue | 17 |
Pages of publication | 3167 - 3174 |
a | 9.5717 ± 0.0005 Å |
b | 10.0806 ± 0.0004 Å |
c | 11.8057 ± 0.0006 Å |
α | 99.281 ± 0.004° |
β | 112.617 ± 0.005° |
γ | 105.83 ± 0.004° |
Cell volume | 965.12 ± 0.1 Å3 |
Cell temperature | 293 ± 2 K |
Ambient diffraction temperature | 293 ± 2 K |
Number of distinct elements | 5 |
Space group number | 2 |
Hermann-Mauguin space group symbol | P -1 |
Hall space group symbol | -P 1 |
Residual factor for all reflections | 0.0651 |
Residual factor for significantly intense reflections | 0.062 |
Weighted residual factors for significantly intense reflections | 0.1693 |
Weighted residual factors for all reflections included in the refinement | 0.1713 |
Goodness-of-fit parameter for all reflections included in the refinement | 1.063 |
Diffraction radiation wavelength | 1.54184 Å |
Diffraction radiation type | CuKα |