Information card for entry 7242525
Formula | C21 H19 Mn N3 O6 |
Calculated formula | C21 H19 Mn N3 O6 |
Title of publication | Highly efficient fluorescent chemosensor for nitro antibiotic detection based on luminescent coordination polymers with 2,6-di(4-carboxyphenyl)pyrazine |
Authors of publication | Sun, Shuang-Li; Sun, Xi-Yu; Sun, Qian; Gao, En-Qing |
Journal of publication | CrystEngComm |
Year of publication | 2021 |
Journal volume | 23 |
Journal issue | 17 |
Pages of publication | 3167 - 3174 |
a | 9.5406 ± 0.0003 Å |
b | 10.0775 ± 0.0003 Å |
c | 11.9021 ± 0.0004 Å |
α | 100.467 ± 0.003° |
β | 112.109 ± 0.003° |
γ | 104.281 ± 0.003° |
Cell volume | 978.23 ± 0.07 Å3 |
Cell temperature | 293 ± 2 K |
Ambient diffraction temperature | 293 ± 2 K |
Number of distinct elements | 5 |
Space group number | 2 |
Hermann-Mauguin space group symbol | P -1 |
Hall space group symbol | -P 1 |
Residual factor for all reflections | 0.0354 |
Residual factor for significantly intense reflections | 0.0345 |
Weighted residual factors for significantly intense reflections | 0.0965 |
Weighted residual factors for all reflections included in the refinement | 0.0971 |
Goodness-of-fit parameter for all reflections included in the refinement | 1.156 |
Diffraction radiation wavelength | 1.54184 Å |
Diffraction radiation type | CuKα |