Information card for entry 7242567
Formula | C26 H14 Cd2 N2 O8 |
Calculated formula | C26 H14 Cd2 N2 O8 |
Title of publication | Two new luminescent Cd(ii)-based coordination polymers by regulating the asymmetrical tetracarboxylate and auxiliary ligands displaying high sensitivity for Fe3+ and CrO42− |
Authors of publication | Wu, Yu; Zhong, Yuyu; Kang, Weiyi; Liu, Yiwei; Yang, Tingting; Zhou, Mi; Zhou, Luyi |
Journal of publication | CrystEngComm |
Year of publication | 2021 |
Journal volume | 23 |
Journal issue | 19 |
Pages of publication | 3460 - 3466 |
a | 10.159 ± 0.0008 Å |
b | 11.0042 ± 0.0006 Å |
c | 11.2516 ± 0.001 Å |
α | 74.652 ± 0.006° |
β | 66.351 ± 0.008° |
γ | 79.654 ± 0.005° |
Cell volume | 1107.27 ± 0.16 Å3 |
Cell temperature | 293 ± 2 K |
Ambient diffraction temperature | 293 ± 2 K |
Number of distinct elements | 5 |
Space group number | 2 |
Hermann-Mauguin space group symbol | P -1 |
Hall space group symbol | -P 1 |
Residual factor for all reflections | 0.0545 |
Residual factor for significantly intense reflections | 0.0456 |
Weighted residual factors for significantly intense reflections | 0.1148 |
Weighted residual factors for all reflections included in the refinement | 0.1201 |
Goodness-of-fit parameter for all reflections included in the refinement | 1.07 |
Diffraction radiation probe | x-ray |
Diffraction radiation wavelength | 1.54184 Å |
Diffraction radiation type | CuKα |