Information card for entry 7242568
Formula | C16 H14 Cd2 O12 |
Calculated formula | C16 H14 Cd2 O12 |
Title of publication | Two new luminescent Cd(ii)-based coordination polymers by regulating the asymmetrical tetracarboxylate and auxiliary ligands displaying high sensitivity for Fe3+ and CrO42− |
Authors of publication | Wu, Yu; Zhong, Yuyu; Kang, Weiyi; Liu, Yiwei; Yang, Tingting; Zhou, Mi; Zhou, Luyi |
Journal of publication | CrystEngComm |
Year of publication | 2021 |
Journal volume | 23 |
Journal issue | 19 |
Pages of publication | 3460 - 3466 |
a | 7.6065 ± 0.0001 Å |
b | 13.9939 ± 0.0003 Å |
c | 20.8616 ± 0.0004 Å |
α | 90° |
β | 91.09 ± 0.002° |
γ | 90° |
Cell volume | 2220.2 ± 0.07 Å3 |
Cell temperature | 293 ± 2 K |
Ambient diffraction temperature | 293 ± 2 K |
Number of distinct elements | 4 |
Space group number | 14 |
Hermann-Mauguin space group symbol | P 1 21/c 1 |
Hall space group symbol | -P 2ybc |
Residual factor for all reflections | 0.037 |
Residual factor for significantly intense reflections | 0.0307 |
Weighted residual factors for significantly intense reflections | 0.0787 |
Weighted residual factors for all reflections included in the refinement | 0.0811 |
Goodness-of-fit parameter for all reflections included in the refinement | 1.068 |
Diffraction radiation probe | x-ray |
Diffraction radiation wavelength | 1.54184 Å |
Diffraction radiation type | CuKα |