Information card for entry 7242569
Formula | C40 H52 N8 O48 W12 Zn2 |
Calculated formula | C40 H52 N8 O48 W12 Zn2 |
Title of publication | Keggin-type polyoxometalate-containing metal‒organic hybrids as friction materials for triboelectric nanogenerators |
Authors of publication | Zhang, Ying-Ying; Hu, Mingjun; Shao, Zhichao; Huang, Chao; Qin, Qi; Mi, Liwei |
Journal of publication | CrystEngComm |
Year of publication | 2021 |
Journal volume | 23 |
Journal issue | 30 |
Pages of publication | 5184 - 5189 |
a | 21.2513 ± 0.0007 Å |
b | 15.2436 ± 0.0005 Å |
c | 24.1678 ± 0.0008 Å |
α | 90° |
β | 106.388 ± 0.001° |
γ | 90° |
Cell volume | 7511 ± 0.4 Å3 |
Cell temperature | 150.15 K |
Ambient diffraction temperature | 150.15 K |
Number of distinct elements | 6 |
Space group number | 15 |
Hermann-Mauguin space group symbol | C 1 2/c 1 |
Hall space group symbol | -C 2yc |
Residual factor for all reflections | 0.0299 |
Residual factor for significantly intense reflections | 0.0293 |
Weighted residual factors for significantly intense reflections | 0.0695 |
Weighted residual factors for all reflections included in the refinement | 0.0698 |
Goodness-of-fit parameter for all reflections included in the refinement | 1.267 |
Diffraction radiation wavelength | 0.71073 Å |
Diffraction radiation type | MoKα |