Information card for entry 7242593
Formula | C41 H70 N8 O16 S4 |
Calculated formula | C41 H70 N8 O16 S4 |
Title of publication | Influence of intermolecular interactions and crystal structure on desolvation mechanisms of solvates |
Authors of publication | Liu, Wanying; Hou, Baohong; Huang, Xin; Zong, Shuyi; Zheng, Zhixin; Li, Shuyu; Zhao, Bugui; Liu, Songqiang; Zhou, Lina; Hao, Hongxun |
Journal of publication | CrystEngComm |
Year of publication | 2021 |
Journal volume | 23 |
Journal issue | 19 |
Pages of publication | 3557 - 3568 |
a | 14.1543 ± 0.0003 Å |
b | 16.755 ± 0.0004 Å |
c | 23.7148 ± 0.0006 Å |
α | 90° |
β | 90° |
γ | 90° |
Cell volume | 5624.1 ± 0.2 Å3 |
Cell temperature | 113.15 K |
Ambient diffraction temperature | 113.15 K |
Number of distinct elements | 5 |
Space group number | 19 |
Hermann-Mauguin space group symbol | P 21 21 21 |
Hall space group symbol | P 2ac 2ab |
Residual factor for all reflections | 0.046 |
Residual factor for significantly intense reflections | 0.042 |
Weighted residual factors for significantly intense reflections | 0.1043 |
Weighted residual factors for all reflections included in the refinement | 0.1066 |
Goodness-of-fit parameter for all reflections included in the refinement | 1.039 |
Diffraction radiation probe | x-ray |
Diffraction radiation wavelength | 0.71073 Å |
Diffraction radiation type | MoKα |