Information card for entry 7242594
Chemical name | 7-Amino-4-methylcoumarin |
Formula | C10 H9 N O2 |
Calculated formula | C10 H9 N O2 |
SMILES | o1c2c(c(cc1=O)C)ccc(c2)N |
Title of publication | A photoluminescent organosuperelastic crystal of 7-amino-4-methylcoumarin |
Authors of publication | Sasaki, Toshiyuki; Ranjan, Subham; Takamizawa, Satoshi |
Journal of publication | CrystEngComm |
Year of publication | 2021 |
Journal volume | 23 |
Journal issue | 34 |
Pages of publication | 5801 - 5804 |
a | 6.9349 ± 0.0019 Å |
b | 7.1467 ± 0.0015 Å |
c | 9.558 ± 0.002 Å |
α | 71.817 ± 0.006° |
β | 84.968 ± 0.008° |
γ | 70.026 ± 0.008° |
Cell volume | 422.89 ± 0.17 Å3 |
Cell temperature | 296 K |
Ambient diffraction temperature | 296 K |
Number of distinct elements | 4 |
Space group number | 2 |
Hermann-Mauguin space group symbol | P -1 |
Hall space group symbol | -P 1 |
Residual factor for all reflections | 0.2083 |
Residual factor for significantly intense reflections | 0.1819 |
Weighted residual factors for significantly intense reflections | 0.4492 |
Weighted residual factors for all reflections included in the refinement | 0.4751 |
Goodness-of-fit parameter for all reflections included in the refinement | 1.653 |
Diffraction radiation wavelength | 0.71073 Å |
Diffraction radiation type | MoKα |