Information card for entry 7242598
Formula | C17 H14 N2 O2 |
Calculated formula | C17 H14 N2 O2 |
SMILES | n1cnc(cc1c1c(O)cccc1)c1c(OC)cccc1 |
Title of publication | Understanding the planar conformations in diarylsubstituted heteroarenes: structural and theoretical insights |
Authors of publication | Zia, Mehwash; Hameed, Shahid; Frontera, Antonio; Irran, Elisabeth; Naseer, Muhammad Moazzam |
Journal of publication | CrystEngComm |
Year of publication | 2021 |
Journal volume | 23 |
Journal issue | 17 |
Pages of publication | 3144 - 3151 |
a | 11.3261 ± 0.0003 Å |
b | 15.5298 ± 0.0004 Å |
c | 8.0963 ± 0.0002 Å |
α | 90° |
β | 105.26 ± 0.003° |
γ | 90° |
Cell volume | 1373.86 ± 0.06 Å3 |
Cell temperature | 150 ± 2 K |
Ambient diffraction temperature | 150 ± 0.1 K |
Number of distinct elements | 4 |
Space group number | 14 |
Hermann-Mauguin space group symbol | P 1 21/c 1 |
Hall space group symbol | -P 2ybc |
Residual factor for all reflections | 0.0398 |
Residual factor for significantly intense reflections | 0.0347 |
Weighted residual factors for significantly intense reflections | 0.0887 |
Weighted residual factors for all reflections included in the refinement | 0.0942 |
Goodness-of-fit parameter for all reflections included in the refinement | 1.034 |
Diffraction radiation probe | x-ray |
Diffraction radiation wavelength | 1.54184 Å |
Diffraction radiation type | CuKα |