Information card for entry 7242599
Formula | C15 H11 N O3 |
Calculated formula | C15 H11 N O3 |
Title of publication | Understanding the planar conformations in diarylsubstituted heteroarenes: structural and theoretical insights |
Authors of publication | Zia, Mehwash; Hameed, Shahid; Frontera, Antonio; Irran, Elisabeth; Naseer, Muhammad Moazzam |
Journal of publication | CrystEngComm |
Year of publication | 2021 |
Journal volume | 23 |
Journal issue | 17 |
Pages of publication | 3144 - 3151 |
a | 14.5352 ± 0.0004 Å |
b | 11.5897 ± 0.0003 Å |
c | 14.2576 ± 0.0006 Å |
α | 90° |
β | 102.137 ± 0.003° |
γ | 90° |
Cell volume | 2348.13 ± 0.14 Å3 |
Cell temperature | 150 ± 2 K |
Ambient diffraction temperature | 150 ± 0.1 K |
Number of distinct elements | 4 |
Space group number | 14 |
Hermann-Mauguin space group symbol | P 1 21/c 1 |
Hall space group symbol | -P 2ybc |
Residual factor for all reflections | 0.0753 |
Residual factor for significantly intense reflections | 0.0476 |
Weighted residual factors for significantly intense reflections | 0.1139 |
Weighted residual factors for all reflections included in the refinement | 0.1347 |
Goodness-of-fit parameter for all reflections included in the refinement | 1.003 |
Diffraction radiation probe | x-ray |
Diffraction radiation wavelength | 1.54184 Å |
Diffraction radiation type | CuKα |