Information card for entry 7242685
Formula | C47 H53 N5 O19 Sm2 |
Calculated formula | C47 H53 N5 O19 Sm2 |
Title of publication | 3D Ln-MOFs as multi-responsive luminescent probes for efficient sensing of Fe3+, Cr2O72−, and antibiotics in aqueous solution |
Authors of publication | Xue, Yun-Shan; Ding, Ji; Sun, Dan-Ling; Cheng, Wei-Wei; Chen, Xuan-Rong; Huang, Xing-Cai; Wang, Jun |
Journal of publication | CrystEngComm |
Year of publication | 2021 |
Journal volume | 23 |
Journal issue | 21 |
Pages of publication | 3838 - 3848 |
a | 28.531 ± 0.002 Å |
b | 14.3021 ± 0.0009 Å |
c | 13.7731 ± 0.0009 Å |
α | 90° |
β | 100.718 ± 0.002° |
γ | 90° |
Cell volume | 5522.1 ± 0.6 Å3 |
Cell temperature | 150 ± 2 K |
Ambient diffraction temperature | 149.99 K |
Number of distinct elements | 5 |
Space group number | 15 |
Hermann-Mauguin space group symbol | C 1 2/c 1 |
Hall space group symbol | -C 2yc |
Residual factor for all reflections | 0.0566 |
Residual factor for significantly intense reflections | 0.0428 |
Weighted residual factors for significantly intense reflections | 0.1071 |
Weighted residual factors for all reflections included in the refinement | 0.1125 |
Goodness-of-fit parameter for all reflections included in the refinement | 1.06 |
Diffraction radiation wavelength | 0.71073 Å |
Diffraction radiation type | MoKα |