Information card for entry 7242686
Formula | C32 H23 Ho2 O16.5 |
Calculated formula | C32 H23 Ho2 O16.5 |
Title of publication | 3D Ln-MOFs as multi-responsive luminescent probes for efficient sensing of Fe3+, Cr2O72−, and antibiotics in aqueous solution |
Authors of publication | Xue, Yun-Shan; Ding, Ji; Sun, Dan-Ling; Cheng, Wei-Wei; Chen, Xuan-Rong; Huang, Xing-Cai; Wang, Jun |
Journal of publication | CrystEngComm |
Year of publication | 2021 |
Journal volume | 23 |
Journal issue | 21 |
Pages of publication | 3838 - 3848 |
a | 19.6548 ± 0.0011 Å |
b | 19.6548 ± 0.0011 Å |
c | 45.295 ± 0.003 Å |
α | 90° |
β | 90° |
γ | 120° |
Cell volume | 15153.7 ± 1.6 Å3 |
Cell temperature | 150 ± 2 K |
Ambient diffraction temperature | 150.01 K |
Number of distinct elements | 4 |
Space group number | 148 |
Hermann-Mauguin space group symbol | R -3 :H |
Hall space group symbol | -R 3 |
Residual factor for all reflections | 0.0533 |
Residual factor for significantly intense reflections | 0.0424 |
Weighted residual factors for significantly intense reflections | 0.1246 |
Weighted residual factors for all reflections included in the refinement | 0.1305 |
Goodness-of-fit parameter for all reflections included in the refinement | 1.086 |
Diffraction radiation wavelength | 0.71073 Å |
Diffraction radiation type | MoKα |