Information card for entry 7242810
Formula | C42 H38 Co N4 O12 |
Calculated formula | C42 H38 Co N4 O12 |
Title of publication | Six CoII coordination polymers exhibiting UV-light-driven photocatalysis for the degradation of organic dyes |
Authors of publication | Lu, Xue; Zhao, Ying; Wang, Xiu-Li; Liu, Guo-Cheng; Xu, Na; Lin, Hong-Yan; Wang, Xiang |
Journal of publication | CrystEngComm |
Year of publication | 2021 |
Journal volume | 23 |
Journal issue | 21 |
Pages of publication | 3828 - 3837 |
a | 9.5008 ± 0.0006 Å |
b | 10.3315 ± 0.0006 Å |
c | 11.4636 ± 0.0007 Å |
α | 86.225 ± 0.001° |
β | 76.084 ± 0.001° |
γ | 67.841 ± 0.001° |
Cell volume | 1011.15 ± 0.11 Å3 |
Cell temperature | 296 ± 2 K |
Ambient diffraction temperature | 296 ± 2 K |
Number of distinct elements | 5 |
Space group number | 2 |
Hermann-Mauguin space group symbol | P -1 |
Hall space group symbol | -P 1 |
Residual factor for all reflections | 0.0637 |
Residual factor for significantly intense reflections | 0.0443 |
Weighted residual factors for significantly intense reflections | 0.1162 |
Weighted residual factors for all reflections included in the refinement | 0.126 |
Goodness-of-fit parameter for all reflections included in the refinement | 1.006 |
Diffraction radiation wavelength | 0.71069 Å |
Diffraction radiation type | MoKα |