Information card for entry 7242811
Formula | C20 H22 Co N2 O6 |
Calculated formula | C20 H22 Co N2 O6 |
Title of publication | Six CoII coordination polymers exhibiting UV-light-driven photocatalysis for the degradation of organic dyes |
Authors of publication | Lu, Xue; Zhao, Ying; Wang, Xiu-Li; Liu, Guo-Cheng; Xu, Na; Lin, Hong-Yan; Wang, Xiang |
Journal of publication | CrystEngComm |
Year of publication | 2021 |
Journal volume | 23 |
Journal issue | 21 |
Pages of publication | 3828 - 3837 |
a | 8.618 ± 0.0011 Å |
b | 9.1037 ± 0.0012 Å |
c | 13.5328 ± 0.0017 Å |
α | 79.294 ± 0.002° |
β | 72.69 ± 0.002° |
γ | 74.067 ± 0.002° |
Cell volume | 968.4 ± 0.2 Å3 |
Cell temperature | 296 ± 2 K |
Ambient diffraction temperature | 296 ± 2 K |
Number of distinct elements | 5 |
Space group number | 2 |
Hermann-Mauguin space group symbol | P -1 |
Hall space group symbol | -P 1 |
Residual factor for all reflections | 0.0442 |
Residual factor for significantly intense reflections | 0.0346 |
Weighted residual factors for significantly intense reflections | 0.0904 |
Weighted residual factors for all reflections included in the refinement | 0.0968 |
Goodness-of-fit parameter for all reflections included in the refinement | 1.01 |
Diffraction radiation wavelength | 0.71069 Å |
Diffraction radiation type | MoKα |