Information card for entry 7242814
Formula | C36 H30 Co N4 O8 |
Calculated formula | C36 H30 Co N4 O8 |
Title of publication | Six CoII coordination polymers exhibiting UV-light-driven photocatalysis for the degradation of organic dyes |
Authors of publication | Lu, Xue; Zhao, Ying; Wang, Xiu-Li; Liu, Guo-Cheng; Xu, Na; Lin, Hong-Yan; Wang, Xiang |
Journal of publication | CrystEngComm |
Year of publication | 2021 |
Journal volume | 23 |
Journal issue | 21 |
Pages of publication | 3828 - 3837 |
a | 8.641 ± 0.001 Å |
b | 14.144 ± 0.0017 Å |
c | 17.121 ± 0.002 Å |
α | 82.368 ± 0.003° |
β | 76.967 ± 0.003° |
γ | 73.737 ± 0.003° |
Cell volume | 1951.6 ± 0.4 Å3 |
Cell temperature | 296 ± 2 K |
Ambient diffraction temperature | 296 ± 2 K |
Number of distinct elements | 5 |
Space group number | 2 |
Hermann-Mauguin space group symbol | P -1 |
Hall space group symbol | -P 1 |
Residual factor for all reflections | 0.0943 |
Residual factor for significantly intense reflections | 0.0574 |
Weighted residual factors for significantly intense reflections | 0.146 |
Weighted residual factors for all reflections included in the refinement | 0.1667 |
Goodness-of-fit parameter for all reflections included in the refinement | 0.967 |
Diffraction radiation wavelength | 0.71069 Å |
Diffraction radiation type | MoKα |