Information card for entry 7242815
Formula | C64 H52 Co2 N10 O19 |
Calculated formula | C64 H51 Co2 N10 O19 |
Title of publication | Six CoII coordination polymers exhibiting UV-light-driven photocatalysis for the degradation of organic dyes |
Authors of publication | Lu, Xue; Zhao, Ying; Wang, Xiu-Li; Liu, Guo-Cheng; Xu, Na; Lin, Hong-Yan; Wang, Xiang |
Journal of publication | CrystEngComm |
Year of publication | 2021 |
Journal volume | 23 |
Journal issue | 21 |
Pages of publication | 3828 - 3837 |
a | 12.9385 ± 0.0019 Å |
b | 15.954 ± 0.002 Å |
c | 16.193 ± 0.002 Å |
α | 113.997 ± 0.003° |
β | 101.122 ± 0.003° |
γ | 92.4 ± 0.003° |
Cell volume | 2969.2 ± 0.7 Å3 |
Cell temperature | 296 ± 2 K |
Ambient diffraction temperature | 296 ± 2 K |
Number of distinct elements | 5 |
Space group number | 2 |
Hermann-Mauguin space group symbol | P -1 |
Hall space group symbol | -P 1 |
Residual factor for all reflections | 0.1457 |
Residual factor for significantly intense reflections | 0.0596 |
Weighted residual factors for significantly intense reflections | 0.1155 |
Weighted residual factors for all reflections included in the refinement | 0.1458 |
Goodness-of-fit parameter for all reflections included in the refinement | 0.997 |
Diffraction radiation wavelength | 0.71069 Å |
Diffraction radiation type | MoKα |