Information card for entry 7242928
Chemical name | 1,2,3,4-Tetrahydro-1,2,2-trimethyl-spiro[cyclopentan-1,3-acenaphth[5,6-bc]azepine]-2,5-dione |
Formula | C20 H19 N O2 |
Calculated formula | C20 H19 N O2 |
Title of publication | Interaction, bond formation or reaction between a dimethylamino group and an adjacent alkene or aldehyde group in aromatic systems controlled by remote molecular constraints |
Authors of publication | Bristow, Jonathan C.; Cliff, Stacey V. A.; Yang, Songjie; Wallis, John D. |
Journal of publication | CrystEngComm |
Year of publication | 2021 |
Journal volume | 23 |
Journal issue | 25 |
Pages of publication | 4500 - 4512 |
a | 10.7625 ± 0.0005 Å |
b | 32.3176 ± 0.001 Å |
c | 8.613 ± 0.0003 Å |
α | 90° |
β | 98.945 ± 0.004° |
γ | 90° |
Cell volume | 2959.3 ± 0.2 Å3 |
Cell temperature | 150.01 ± 0.1 K |
Ambient diffraction temperature | 150.01 ± 0.1 K |
Number of distinct elements | 4 |
Space group number | 14 |
Hermann-Mauguin space group symbol | P 1 21/c 1 |
Hall space group symbol | -P 2ybc |
Residual factor for all reflections | 0.1484 |
Residual factor for significantly intense reflections | 0.104 |
Weighted residual factors for significantly intense reflections | 0.1877 |
Weighted residual factors for all reflections included in the refinement | 0.2072 |
Goodness-of-fit parameter for all reflections included in the refinement | 1.15 |
Diffraction radiation probe | x-ray |
Diffraction radiation wavelength | 0.71073 Å |
Diffraction radiation type | MoKα |