Information card for entry 7242929
Chemical name | 4,5-diiodo-9,9-dimethyl-9H-fluorene |
Formula | C15 H12 I2 |
Calculated formula | C15 H12 I2 |
SMILES | Ic1cccc2c1c1c(I)cccc1C2(C)C |
Title of publication | Interaction, bond formation or reaction between a dimethylamino group and an adjacent alkene or aldehyde group in aromatic systems controlled by remote molecular constraints |
Authors of publication | Bristow, Jonathan C.; Cliff, Stacey V. A.; Yang, Songjie; Wallis, John D. |
Journal of publication | CrystEngComm |
Year of publication | 2021 |
Journal volume | 23 |
Journal issue | 25 |
Pages of publication | 4500 - 4512 |
a | 8.4109 ± 0.0002 Å |
b | 9.6735 ± 0.0003 Å |
c | 17.0655 ± 0.0005 Å |
α | 90° |
β | 90.496 ± 0.002° |
γ | 90° |
Cell volume | 1388.45 ± 0.07 Å3 |
Cell temperature | 150.01 ± 0.1 K |
Ambient diffraction temperature | 150.01 ± 0.1 K |
Number of distinct elements | 3 |
Space group number | 14 |
Hermann-Mauguin space group symbol | P 1 21/c 1 |
Hall space group symbol | -P 2ybc |
Residual factor for all reflections | 0.0366 |
Residual factor for significantly intense reflections | 0.0289 |
Weighted residual factors for significantly intense reflections | 0.0613 |
Weighted residual factors for all reflections included in the refinement | 0.0646 |
Goodness-of-fit parameter for all reflections included in the refinement | 1.05 |
Diffraction radiation probe | x-ray |
Diffraction radiation wavelength | 0.71073 Å |
Diffraction radiation type | MoKα |