Information card for entry 7243736
Formula | C18 H22 N12 O Pb2 S4 |
Calculated formula | C18 H22 N12 O Pb2 S4 |
Title of publication | Lead(ii) supramolecular structures formed through a cooperative influence of the hydrazinecarbothioamide derived and ancillary ligands |
Authors of publication | García-Santos, Isabel; Castiñeiras, Alfonso; Mahmoudi, Ghodrat; Babashkina, Maria G.; Zangrando, Ennio; Gomila, Rosa M.; Frontera, Antonio; Safin, Damir A. |
Journal of publication | CrystEngComm |
Year of publication | 2022 |
Journal volume | 24 |
Journal issue | 2 |
Pages of publication | 368 - 378 |
a | 20.419 ± 0.001 Å |
b | 10.2159 ± 0.0006 Å |
c | 12.8155 ± 0.0007 Å |
α | 90° |
β | 99.731 ± 0.002° |
γ | 90° |
Cell volume | 2634.8 ± 0.2 Å3 |
Cell temperature | 100 ± 2 K |
Ambient diffraction temperature | 100 ± 2 K |
Number of distinct elements | 6 |
Space group number | 15 |
Hermann-Mauguin space group symbol | C 1 2/c 1 |
Hall space group symbol | -C 2yc |
Residual factor for all reflections | 0.0248 |
Residual factor for significantly intense reflections | 0.0186 |
Weighted residual factors for significantly intense reflections | 0.034 |
Weighted residual factors for all reflections included in the refinement | 0.0353 |
Goodness-of-fit parameter for all reflections included in the refinement | 1.057 |
Diffraction radiation wavelength | 0.71073 Å |
Diffraction radiation type | MoKα |