Information card for entry 7243737
Formula | C17 H26 N12 O8 Pb2 S2 |
Calculated formula | C17 H26 N12 O8 Pb2 S2 |
Title of publication | Lead(ii) supramolecular structures formed through a cooperative influence of the hydrazinecarbothioamide derived and ancillary ligands |
Authors of publication | García-Santos, Isabel; Castiñeiras, Alfonso; Mahmoudi, Ghodrat; Babashkina, Maria G.; Zangrando, Ennio; Gomila, Rosa M.; Frontera, Antonio; Safin, Damir A. |
Journal of publication | CrystEngComm |
Year of publication | 2022 |
Journal volume | 24 |
Journal issue | 2 |
Pages of publication | 368 - 378 |
a | 20.5481 ± 0.0007 Å |
b | 10.7642 ± 0.0003 Å |
c | 12.7256 ± 0.0004 Å |
α | 90° |
β | 97.74 ± 0.001° |
γ | 90° |
Cell volume | 2789.05 ± 0.15 Å3 |
Cell temperature | 100 ± 2 K |
Ambient diffraction temperature | 100 ± 2 K |
Number of distinct elements | 6 |
Space group number | 15 |
Hermann-Mauguin space group symbol | C 1 2/c 1 |
Hall space group symbol | -C 2yc |
Residual factor for all reflections | 0.0212 |
Residual factor for significantly intense reflections | 0.0173 |
Weighted residual factors for significantly intense reflections | 0.0366 |
Weighted residual factors for all reflections included in the refinement | 0.0376 |
Goodness-of-fit parameter for all reflections included in the refinement | 1.064 |
Diffraction radiation wavelength | 0.71073 Å |
Diffraction radiation type | MoKα |