Information card for entry 7243939
Chemical name | zinc;2-methylimidazol-3-ide |
Formula | C8 H10 N4 Zn |
Calculated formula | C8 H10 N4 Zn |
Title of publication | Structure determination of small molecule compounds by an electron diffractometer for 3D ED/MicroED |
Authors of publication | Ito, Sho; White, Fraser J.; Okunishi, Eiji; Aoyama, Yoshitaka; Yamano, Akihito; Sato, Hiroyasu; Ferrara, Joseph D.; Jasnowski, Michał; Meyer, Mathias |
Journal of publication | CrystEngComm |
Year of publication | 2021 |
Journal volume | 23 |
Journal issue | 48 |
Pages of publication | 8622 - 8630 |
a | 17.497 ± 0.005 Å |
b | 17.497 ± 0.005 Å |
c | 17.497 ± 0.005 Å |
α | 90° |
β | 90° |
γ | 90° |
Cell volume | 5357 ± 3 Å3 |
Cell temperature | 293 K |
Ambient diffraction temperature | 293 K |
Number of distinct elements | 4 |
Space group number | 217 |
Hermann-Mauguin space group symbol | I -4 3 m |
Hall space group symbol | I -4 2 3 |
Residual factor for all reflections | 0.1644 |
Residual factor for significantly intense reflections | 0.1137 |
Weighted residual factors for significantly intense reflections | 0.2787 |
Weighted residual factors for all reflections included in the refinement | 0.3136 |
Goodness-of-fit parameter for all reflections included in the refinement | 1.089 |
Diffraction radiation probe | electron |
Diffraction radiation wavelength | 0.0251 Å |
Diffraction radiation type | 200keVelectrons |