Information card for entry 7243940
Formula | Cl4 K2 Pt |
Calculated formula | Cl4 K2 Pt |
Title of publication | Structure determination of small molecule compounds by an electron diffractometer for 3D ED/MicroED |
Authors of publication | Ito, Sho; White, Fraser J.; Okunishi, Eiji; Aoyama, Yoshitaka; Yamano, Akihito; Sato, Hiroyasu; Ferrara, Joseph D.; Jasnowski, Michał; Meyer, Mathias |
Journal of publication | CrystEngComm |
Year of publication | 2021 |
Journal volume | 23 |
Journal issue | 48 |
Pages of publication | 8622 - 8630 |
a | 7.0688 ± 0.0011 Å |
b | 7.0688 ± 0.0011 Å |
c | 4.157 ± 0.0016 Å |
α | 90° |
β | 90° |
γ | 90° |
Cell volume | 207.72 ± 0.09 Å3 |
Cell temperature | 293 K |
Ambient diffraction temperature | 293 K |
Number of distinct elements | 3 |
Space group number | 123 |
Hermann-Mauguin space group symbol | P 4/m m m |
Hall space group symbol | -P 4 2 |
Residual factor for all reflections | 0.1652 |
Residual factor for significantly intense reflections | 0.1652 |
Weighted residual factors for significantly intense reflections | 0.4466 |
Weighted residual factors for all reflections included in the refinement | 0.4466 |
Goodness-of-fit parameter for all reflections included in the refinement | 3.167 |
Diffraction radiation probe | electron |
Diffraction radiation wavelength | 0.0251 Å |
Diffraction radiation type | 200keVelectrons |