Information card for entry 7246342
Formula | C18 H16 Br4 Cd N2 O2 |
Calculated formula | C18 H16 Br4 Cd N2 O2 |
Title of publication | On structural factors determining the nature of the fluorescent properties of OIHMs based on 8-hydroxyquinoline |
Authors of publication | Bogdan, Marta; Sierański, Tomasz; Świątkowski, Marcin; Trzęsowska-Kruszyńska, Agata |
Journal of publication | CrystEngComm |
Year of publication | 2023 |
Journal volume | 25 |
Journal issue | 13 |
Pages of publication | 1993 - 2002 |
a | 15.7785 ± 0.0006 Å |
b | 8.5996 ± 0.0003 Å |
c | 16.6373 ± 0.0007 Å |
α | 90° |
β | 92.28 ± 0.004° |
γ | 90° |
Cell volume | 2255.71 ± 0.15 Å3 |
Cell temperature | 100 ± 0.1 K |
Ambient diffraction temperature | 100 ± 0.1 K |
Number of distinct elements | 6 |
Space group number | 15 |
Hermann-Mauguin space group symbol | C 1 2/c 1 |
Hall space group symbol | -C 2yc |
Residual factor for all reflections | 0.0225 |
Residual factor for significantly intense reflections | 0.0173 |
Weighted residual factors for significantly intense reflections | 0.0381 |
Weighted residual factors for all reflections included in the refinement | 0.0394 |
Goodness-of-fit parameter for all reflections included in the refinement | 1.029 |
Diffraction radiation probe | x-ray |
Diffraction radiation wavelength | 0.71073 Å |
Diffraction radiation type | MoKα |