Information card for entry 7246343
Formula | C9 H12 Cl3 Hg N O3 |
Calculated formula | C9 H12 Cl3 Hg N O3 |
Title of publication | On structural factors determining the nature of the fluorescent properties of OIHMs based on 8-hydroxyquinoline |
Authors of publication | Bogdan, Marta; Sierański, Tomasz; Świątkowski, Marcin; Trzęsowska-Kruszyńska, Agata |
Journal of publication | CrystEngComm |
Year of publication | 2023 |
Journal volume | 25 |
Journal issue | 13 |
Pages of publication | 1993 - 2002 |
a | 13.7376 ± 0.0004 Å |
b | 4.3663 ± 0.0002 Å |
c | 22.527 ± 0.0008 Å |
α | 90° |
β | 95.846 ± 0.003° |
γ | 90° |
Cell volume | 1344.2 ± 0.09 Å3 |
Cell temperature | 100 ± 0.1 K |
Ambient diffraction temperature | 100 ± 0.1 K |
Number of distinct elements | 6 |
Space group number | 14 |
Hermann-Mauguin space group symbol | P 1 21/n 1 |
Hall space group symbol | -P 2yn |
Residual factor for all reflections | 0.0159 |
Residual factor for significantly intense reflections | 0.0144 |
Weighted residual factors for significantly intense reflections | 0.0338 |
Weighted residual factors for all reflections included in the refinement | 0.0342 |
Goodness-of-fit parameter for all reflections included in the refinement | 1.046 |
Diffraction radiation probe | x-ray |
Diffraction radiation wavelength | 0.71073 Å |
Diffraction radiation type | MoKα |