Information card for entry 7246347
Formula | C18 H16 Br4 Co N2 O2 |
Calculated formula | C18 H16 Br4 Co N2 O2 |
Title of publication | On structural factors determining the nature of the fluorescent properties of OIHMs based on 8-hydroxyquinoline |
Authors of publication | Bogdan, Marta; Sierański, Tomasz; Świątkowski, Marcin; Trzęsowska-Kruszyńska, Agata |
Journal of publication | CrystEngComm |
Year of publication | 2023 |
Journal volume | 25 |
Journal issue | 13 |
Pages of publication | 1993 - 2002 |
a | 17.0128 ± 0.0006 Å |
b | 7.1435 ± 0.0002 Å |
c | 17.1911 ± 0.0007 Å |
α | 90° |
β | 90.158 ± 0.003° |
γ | 90° |
Cell volume | 2089.24 ± 0.13 Å3 |
Cell temperature | 100 ± 0.1 K |
Ambient diffraction temperature | 100 ± 0.1 K |
Number of distinct elements | 6 |
Space group number | 13 |
Hermann-Mauguin space group symbol | P 1 2/n 1 |
Hall space group symbol | -P 2yac |
Residual factor for all reflections | 0.1064 |
Residual factor for significantly intense reflections | 0.0805 |
Weighted residual factors for significantly intense reflections | 0.2159 |
Weighted residual factors for all reflections included in the refinement | 0.2344 |
Goodness-of-fit parameter for all reflections included in the refinement | 1.097 |
Diffraction radiation probe | x-ray |
Diffraction radiation wavelength | 0.71073 Å |
Diffraction radiation type | MoKα |