Information card for entry 7246348
Formula | C18 H16 Br4 Hg N2 O2 |
Calculated formula | C18 H16 Br4 Hg N2 O2 |
Title of publication | On structural factors determining the nature of the fluorescent properties of OIHMs based on 8-hydroxyquinoline |
Authors of publication | Bogdan, Marta; Sierański, Tomasz; Świątkowski, Marcin; Trzęsowska-Kruszyńska, Agata |
Journal of publication | CrystEngComm |
Year of publication | 2023 |
Journal volume | 25 |
Journal issue | 13 |
Pages of publication | 1993 - 2002 |
a | 17.0829 ± 0.0008 Å |
b | 7.2297 ± 0.0003 Å |
c | 17.2934 ± 0.0008 Å |
α | 90° |
β | 90.388 ± 0.004° |
γ | 90° |
Cell volume | 2135.76 ± 0.17 Å3 |
Cell temperature | 100 ± 0.1 K |
Ambient diffraction temperature | 100 ± 0.1 K |
Number of distinct elements | 6 |
Space group number | 13 |
Hermann-Mauguin space group symbol | P 1 2/n 1 |
Hall space group symbol | -P 2yac |
Residual factor for all reflections | 0.0458 |
Residual factor for significantly intense reflections | 0.0361 |
Weighted residual factors for significantly intense reflections | 0.0861 |
Weighted residual factors for all reflections included in the refinement | 0.0901 |
Goodness-of-fit parameter for all reflections included in the refinement | 1.04 |
Diffraction radiation probe | x-ray |
Diffraction radiation wavelength | 0.71073 Å |
Diffraction radiation type | MoKα |