Information card for entry 7246359
Formula | C35 H34 N6 O5 Zn |
Calculated formula | C35 H34 N6 O5 Zn |
Title of publication | Construction of ZnII/CdII-CPs and their fluorescent detection for Fe3+, Cr2O72− and TNP in water via luminescence quenching |
Authors of publication | Li, Chaoxiong; Sun, Xuancheng; Meng, Xianggao; Wang, Dunjia; Zheng, Chunyang |
Journal of publication | CrystEngComm |
Year of publication | 2023 |
Journal volume | 25 |
Journal issue | 18 |
Pages of publication | 2728 - 2738 |
a | 14.371 ± 0.0002 Å |
b | 19.0998 ± 0.0002 Å |
c | 23.8664 ± 0.0002 Å |
α | 90° |
β | 90° |
γ | 90° |
Cell volume | 6550.93 ± 0.13 Å3 |
Cell temperature | 293 ± 2 K |
Ambient diffraction temperature | 293 ± 2 K |
Number of distinct elements | 5 |
Space group number | 61 |
Hermann-Mauguin space group symbol | P b c a |
Hall space group symbol | -P 2ac 2ab |
Residual factor for all reflections | 0.0558 |
Residual factor for significantly intense reflections | 0.0497 |
Weighted residual factors for significantly intense reflections | 0.1412 |
Weighted residual factors for all reflections included in the refinement | 0.1464 |
Goodness-of-fit parameter for all reflections included in the refinement | 1.038 |
Diffraction radiation probe | x-ray |
Diffraction radiation wavelength | 1.54184 Å |
Diffraction radiation type | CuKα |