Information card for entry 7246360
Formula | C29 H28 Cd N2 O7 |
Calculated formula | C26 H19 Cd N2 O5 |
Title of publication | Construction of ZnII/CdII-CPs and their fluorescent detection for Fe3+, Cr2O72− and TNP in water via luminescence quenching |
Authors of publication | Li, Chaoxiong; Sun, Xuancheng; Meng, Xianggao; Wang, Dunjia; Zheng, Chunyang |
Journal of publication | CrystEngComm |
Year of publication | 2023 |
Journal volume | 25 |
Journal issue | 18 |
Pages of publication | 2728 - 2738 |
a | 28.8765 ± 0.0004 Å |
b | 23.5183 ± 0.0004 Å |
c | 16.9031 ± 0.0002 Å |
α | 90° |
β | 90° |
γ | 90° |
Cell volume | 11479.3 ± 0.3 Å3 |
Cell temperature | 293 ± 2 K |
Ambient diffraction temperature | 293 ± 2 K |
Number of distinct elements | 5 |
Space group number | 64 |
Hermann-Mauguin space group symbol | C m c e |
Hall space group symbol | -C 2ac 2 |
Residual factor for all reflections | 0.0779 |
Residual factor for significantly intense reflections | 0.0758 |
Weighted residual factors for significantly intense reflections | 0.2125 |
Weighted residual factors for all reflections included in the refinement | 0.2161 |
Goodness-of-fit parameter for all reflections included in the refinement | 1.079 |
Diffraction radiation probe | x-ray |
Diffraction radiation wavelength | 1.54184 Å |
Diffraction radiation type | CuKα |