Information card for entry 7246361
Formula | C29 H28 N3 O7 Zn |
Calculated formula | C26 H19 N2 O5 Zn |
Title of publication | Construction of ZnII/CdII-CPs and their fluorescent detection for Fe3+, Cr2O72− and TNP in water via luminescence quenching |
Authors of publication | Li, Chaoxiong; Sun, Xuancheng; Meng, Xianggao; Wang, Dunjia; Zheng, Chunyang |
Journal of publication | CrystEngComm |
Year of publication | 2023 |
Journal volume | 25 |
Journal issue | 18 |
Pages of publication | 2728 - 2738 |
a | 29.0368 ± 0.0003 Å |
b | 22.6033 ± 0.0002 Å |
c | 16.92391 ± 0.00015 Å |
α | 90° |
β | 90° |
γ | 90° |
Cell volume | 11107.6 ± 0.18 Å3 |
Cell temperature | 293 ± 2 K |
Ambient diffraction temperature | 293 ± 2 K |
Number of distinct elements | 5 |
Space group number | 64 |
Hermann-Mauguin space group symbol | C m c e |
Hall space group symbol | -C 2ac 2 |
Residual factor for all reflections | 0.0391 |
Residual factor for significantly intense reflections | 0.0351 |
Weighted residual factors for significantly intense reflections | 0.1066 |
Weighted residual factors for all reflections included in the refinement | 0.11 |
Goodness-of-fit parameter for all reflections included in the refinement | 1.085 |
Diffraction radiation probe | x-ray |
Diffraction radiation wavelength | 1.54184 Å |
Diffraction radiation type | CuKα |