Information card for entry 7246377
Formula | C13 H11 Cl2 N3 O3 S |
Calculated formula | C13 H11 Cl2 N3 O3 S |
Title of publication | Synthesis, X-ray characterization and DFT calculations of a series of 3-substituted 4,5-dichloroisothiazoles |
Authors of publication | Kolesnik, Irina A.; Potkin, Vladimir I.; Grigoriev, Mikhail S.; Novikov, Anton P.; Gomila, Rosa M.; Podrezova, Alexandra G.; Brazhkin, Vadim V.; Zubkov, Fedor I.; Frontera, Antonio |
Journal of publication | CrystEngComm |
Year of publication | 2023 |
Journal volume | 25 |
Journal issue | 13 |
Pages of publication | 1976 - 1985 |
a | 7.542 ± 0.0014 Å |
b | 8.8365 ± 0.0016 Å |
c | 11.384 ± 0.002 Å |
α | 83.566 ± 0.006° |
β | 83.963 ± 0.006° |
γ | 88.682 ± 0.006° |
Cell volume | 749.7 ± 0.2 Å3 |
Cell temperature | 100 ± 2 K |
Ambient diffraction temperature | 100 ± 2 K |
Number of distinct elements | 6 |
Space group number | 2 |
Hermann-Mauguin space group symbol | P -1 |
Hall space group symbol | -P 1 |
Residual factor for all reflections | 0.1077 |
Residual factor for significantly intense reflections | 0.0527 |
Weighted residual factors for significantly intense reflections | 0.1013 |
Weighted residual factors for all reflections included in the refinement | 0.1207 |
Goodness-of-fit parameter for all reflections included in the refinement | 0.993 |
Diffraction radiation wavelength | 0.71073 Å |
Diffraction radiation type | MoKα |