Information card for entry 7246378
Formula | C141 H114 N13 O33 Zn6 |
Calculated formula | C141 H114 N13 O33 Zn6 |
Title of publication | Luminescence properties of mixed-ligand MOFs containing fluorene scaffolds functionalized with isonicotinoyl arms |
Authors of publication | Delledonne, Andrea; Orlandini, Martina; Terenziani, Francesca; Mazzeo, Paolo Pio; Bacchi, Alessia; Carlucci, Lucia; Comotti, Angiolina; Perego, Jacopo; Pelagatti, Paolo |
Journal of publication | CrystEngComm |
Year of publication | 2023 |
Journal volume | 25 |
Journal issue | 14 |
Pages of publication | 2085 - 2095 |
a | 17.6312 ± 0.0007 Å |
b | 19.4232 ± 0.0004 Å |
c | 31.839 ± 0.0012 Å |
α | 104.948 ± 0.003° |
β | 103.585 ± 0.003° |
γ | 90.131 ± 0.003° |
Cell volume | 10216.7 ± 0.6 Å3 |
Cell temperature | 100 ± 2 K |
Ambient diffraction temperature | 100 K |
Number of distinct elements | 5 |
Space group number | 2 |
Hermann-Mauguin space group symbol | P -1 |
Hall space group symbol | -P 1 |
Residual factor for all reflections | 0.1688 |
Residual factor for significantly intense reflections | 0.1422 |
Weighted residual factors for significantly intense reflections | 0.4017 |
Weighted residual factors for all reflections included in the refinement | 0.4218 |
Goodness-of-fit parameter for all reflections included in the refinement | 1.512 |
Diffraction radiation wavelength | 0.7 Å |
Diffraction radiation type | synchrotron |