Information card for entry 7246483
Formula | C10 H13 Mn N0 O8 |
Calculated formula | C10 H13 Mn O8 |
Title of publication | Three isostructural MOFs based on different metal cations: proton conductivities and SC–SC transformation leading to magnetic changes |
Authors of publication | Zou, Huiqi; Li, Rongyun; Ding, Li; Lu, Jing; Tian, Haiquan; Yan, Hui; Liu, Houting; Wang, Suna; Li, Yunwu |
Journal of publication | CrystEngComm |
Year of publication | 2023 |
Journal volume | 25 |
Journal issue | 18 |
Pages of publication | 2755 - 2766 |
a | 8.1304 ± 0.0007 Å |
b | 8.2667 ± 0.001 Å |
c | 10.0751 ± 0.0007 Å |
α | 80.531 ± 0.008° |
β | 70.026 ± 0.007° |
γ | 83.552 ± 0.008° |
Cell volume | 626.61 ± 0.11 Å3 |
Cell temperature | 293 ± 2 K |
Ambient diffraction temperature | 293 ± 2 K |
Number of distinct elements | 5 |
Space group number | 2 |
Hermann-Mauguin space group symbol | P -1 |
Hall space group symbol | -P 1 |
Residual factor for all reflections | 0.0892 |
Residual factor for significantly intense reflections | 0.0807 |
Weighted residual factors for significantly intense reflections | 0.2211 |
Weighted residual factors for all reflections included in the refinement | 0.2389 |
Goodness-of-fit parameter for all reflections included in the refinement | 1.089 |
Diffraction radiation wavelength | 1.54184 Å |
Diffraction radiation type | CuKα |