Information card for entry 7246484
Formula | C10 H13 Co O8 |
Calculated formula | C10 H13 Co O8 |
Title of publication | Three isostructural MOFs based on different metal cations: proton conductivities and SC–SC transformation leading to magnetic changes |
Authors of publication | Zou, Huiqi; Li, Rongyun; Ding, Li; Lu, Jing; Tian, Haiquan; Yan, Hui; Liu, Houting; Wang, Suna; Li, Yunwu |
Journal of publication | CrystEngComm |
Year of publication | 2023 |
Journal volume | 25 |
Journal issue | 18 |
Pages of publication | 2755 - 2766 |
a | 7.8186 ± 0.0019 Å |
b | 8.4237 ± 0.0014 Å |
c | 9.8767 ± 0.0017 Å |
α | 68.312 ± 0.016° |
β | 81.997 ± 0.018° |
γ | 87.309 ± 0.016° |
Cell volume | 598.6 ± 0.2 Å3 |
Cell temperature | 293 ± 2 K |
Ambient diffraction temperature | 293 ± 2 K |
Number of distinct elements | 4 |
Space group number | 2 |
Hermann-Mauguin space group symbol | P -1 |
Hall space group symbol | -P 1 |
Residual factor for all reflections | 0.11 |
Residual factor for significantly intense reflections | 0.0696 |
Weighted residual factors for significantly intense reflections | 0.169 |
Weighted residual factors for all reflections included in the refinement | 0.1955 |
Goodness-of-fit parameter for all reflections included in the refinement | 0.962 |
Diffraction radiation wavelength | 1.54184 Å |
Diffraction radiation type | CuKα |