Information card for entry 7246535
Formula | C19 H26 O2 |
Calculated formula | C19 H26 O2 |
Title of publication | Polymorph prediction through observed structural isomorphism leading to a new crystalline form of cannabidiol |
Authors of publication | Straker, Hannah E.; McMillan, Lynn; Mardiana, Lina; Hebberd, Glen R.; Watson, Elle; Waddell, Paul G.; Probert, Michael R.; Hall, Michael J. |
Journal of publication | CrystEngComm |
Year of publication | 2023 |
Journal volume | 25 |
Journal issue | 16 |
Pages of publication | 2479 - 2484 |
a | 9.5113 ± 0.0004 Å |
b | 12.2963 ± 0.0005 Å |
c | 14.3259 ± 0.0005 Å |
α | 90° |
β | 90° |
γ | 90° |
Cell volume | 1675.47 ± 0.11 Å3 |
Cell temperature | 150 K |
Ambient diffraction temperature | 150 K |
Number of distinct elements | 3 |
Space group number | 19 |
Hermann-Mauguin space group symbol | P 21 21 21 |
Hall space group symbol | P 2ac 2ab |
Residual factor for all reflections | 0.0259 |
Residual factor for significantly intense reflections | 0.0258 |
Weighted residual factors for significantly intense reflections | 0.0675 |
Weighted residual factors for all reflections included in the refinement | 0.0676 |
Goodness-of-fit parameter for all reflections included in the refinement | 1.043 |
Diffraction radiation probe | x-ray |
Diffraction radiation wavelength | 1.54178 Å |
Diffraction radiation type | CuKα |