Information card for entry 7246536
Formula | C21 H30 O2 |
Calculated formula | C21 H30 O2 |
Title of publication | Polymorph prediction through observed structural isomorphism leading to a new crystalline form of cannabidiol |
Authors of publication | Straker, Hannah E.; McMillan, Lynn; Mardiana, Lina; Hebberd, Glen R.; Watson, Elle; Waddell, Paul G.; Probert, Michael R.; Hall, Michael J. |
Journal of publication | CrystEngComm |
Year of publication | 2023 |
Journal volume | 25 |
Journal issue | 16 |
Pages of publication | 2479 - 2484 |
a | 10.43482 ± 0.00016 Å |
b | 10.88547 ± 0.00017 Å |
c | 16.7749 ± 0.0003 Å |
α | 90° |
β | 95.4518 ± 0.0015° |
γ | 90° |
Cell volume | 1896.81 ± 0.05 Å3 |
Cell temperature | 150 ± 0.2 K |
Ambient diffraction temperature | 150 ± 0.2 K |
Number of distinct elements | 3 |
Space group number | 4 |
Hermann-Mauguin space group symbol | P 1 21 1 |
Hall space group symbol | P 2yb |
Residual factor for all reflections | 0.0425 |
Residual factor for significantly intense reflections | 0.0344 |
Weighted residual factors for significantly intense reflections | 0.0794 |
Weighted residual factors for all reflections included in the refinement | 0.0856 |
Goodness-of-fit parameter for all reflections included in the refinement | 1.08 |
Diffraction radiation probe | x-ray |
Diffraction radiation wavelength | 1.54184 Å |
Diffraction radiation type | CuKα |