Information card for entry 7246577
Formula | C48 H50 Cu4 N6 O22 |
Calculated formula | C48 H50 Cu4 N6 O22 |
Title of publication | Design and synthesis of copper(ii) malonates with N,N′-containing linkers |
Authors of publication | Zorina-Tikhonova, Ekaterina N.; Chistyakov, Aleksandr S.; Novikova, Veronika A.; Knyazev, Daniil A.; Gogoleva, Natalia V.; Blinou, Daniil O.; Efimov, Nikolay N.; Dorovatovskii, Pavel V.; Kiskin, Mikhail A.; Eremenko, Igor L.; Vologzhanina, Anna V. |
Journal of publication | CrystEngComm |
Year of publication | 2023 |
Journal volume | 25 |
Journal issue | 19 |
Pages of publication | 2859 - 2870 |
a | 13.4822 ± 0.0009 Å |
b | 10.2082 ± 0.0007 Å |
c | 19.4797 ± 0.0013 Å |
α | 90° |
β | 105.29 ± 0.002° |
γ | 90° |
Cell volume | 2586.1 ± 0.3 Å3 |
Cell temperature | 120 K |
Ambient diffraction temperature | 120 K |
Number of distinct elements | 5 |
Space group number | 14 |
Hermann-Mauguin space group symbol | P 1 21/n 1 |
Hall space group symbol | -P 2yn |
Residual factor for all reflections | 0.1031 |
Residual factor for significantly intense reflections | 0.0501 |
Weighted residual factors for significantly intense reflections | 0.0933 |
Weighted residual factors for all reflections included in the refinement | 0.11 |
Goodness-of-fit parameter for all reflections included in the refinement | 0.996 |
Diffraction radiation wavelength | 0.71073 Å |
Diffraction radiation type | MoKα |