Information card for entry 7246578
Formula | C17 H18 Cu N2 O5 |
Calculated formula | C17 H18 Cu N2 O5 |
Title of publication | Design and synthesis of copper(ii) malonates with N,N′-containing linkers |
Authors of publication | Zorina-Tikhonova, Ekaterina N.; Chistyakov, Aleksandr S.; Novikova, Veronika A.; Knyazev, Daniil A.; Gogoleva, Natalia V.; Blinou, Daniil O.; Efimov, Nikolay N.; Dorovatovskii, Pavel V.; Kiskin, Mikhail A.; Eremenko, Igor L.; Vologzhanina, Anna V. |
Journal of publication | CrystEngComm |
Year of publication | 2023 |
Journal volume | 25 |
Journal issue | 19 |
Pages of publication | 2859 - 2870 |
a | 13.4355 ± 0.0011 Å |
b | 14.4906 ± 0.0012 Å |
c | 8.9824 ± 0.0007 Å |
α | 90° |
β | 99.255 ± 0.002° |
γ | 90° |
Cell volume | 1726 ± 0.2 Å3 |
Cell temperature | 120 K |
Ambient diffraction temperature | 120 K |
Number of distinct elements | 5 |
Space group number | 14 |
Hermann-Mauguin space group symbol | P 1 21/c 1 |
Hall space group symbol | -P 2ybc |
Residual factor for all reflections | 0.0604 |
Residual factor for significantly intense reflections | 0.0421 |
Weighted residual factors for significantly intense reflections | 0.1033 |
Weighted residual factors for all reflections included in the refinement | 0.1106 |
Goodness-of-fit parameter for all reflections included in the refinement | 1.053 |
Diffraction radiation wavelength | 0.71073 Å |
Diffraction radiation type | MoKα |